Target
Alpha-1A adrenergic receptor
Ligand
BDBM50068818
Substrate
Meas. Tech.
ChEMBL_33615 (CHEMBL652822)
Ki
3.94±n/a nM
Citation
 Nagarathnam, DWetzel, JMMiao, SWMarzabadi, MRChiu, GWong, WCHong, XFang, JForray, CBranchek, TAHeydorn, WEChang, RSBroten, TSchorn, TWGluchowski, C Design and synthesis of novel alpha1a adrenoceptor-selective dihydropyridine antagonists for the treatment of benign prostatic hyperplasia. J Med Chem 41:5320-33 (1999)  
Target
Name:
Alpha-1A adrenergic receptor
Synonyms:
ADA1A_HUMAN ADRA1C Alpha 1A-adrenoceptor Alpha adrenergic receptor 1a Alpha-adrenergic receptor 1c adrenergic Alpha1 | adrenergic Alpha1C
Type:
Cell-surface receptors
Mol. Mass.:
51511.67
Organism:
Homo sapiens (Human)
Description:
P35348
Residue:
466
  
Inhibitor
Name:
BDBM50068818
Synonyms:
1-(3-{[2,6-Dimethyl-5-methylcarbamoyl-4-(4-nitro-phenyl)-1,4-dihydro-pyridine-3-carbonyl]-amino}-propyl)-4-phenyl-piperidine-4-carboxylic acid methyl ester | CHEMBL147077
Type:
Small organic molecule
Emp. Form.:
C32H39N5O6
Mol. Mass.:
589.682
SMILES:
CNC(=O)C1C(C(C(=O)NCCCN2CCC(CC2)(C(=O)OC)c2ccccc2)=C(C)N=C1C)c1ccc(cc1)[N+]([O-])=O
: