Target
Cysteinyl leukotriene receptor 1
Ligand
BDBM50069356
Substrate
Meas. Tech.
ChEBML_99993
IC50
0.250000±n/a nM
Citation
 Guay, DGauthier, JYDufresne, CJones, TRMcAuliffe, MMcFarlane, CMetters, KMPrasit, PRochette, CRoy, PSawyer, NZamboni, R A series of non-quinoline cysLT1 receptor antagonists: SAR study on pyridyl analogs of Singulair. Bioorg Med Chem Lett 8:453-8 (1999)  
Target
Name:
Cysteinyl leukotriene receptor 1
Synonyms:
CLTR1_HUMAN CYSLTR1 Cysteinyl leukotriene receptor HG55 LTD4 receptor | Leukotriene Cysteinyl 1
Type:
Enzyme Catalytic Domain
Mol. Mass.:
38565.16
Organism:
Homo sapiens (Human)
Description:
Leukotriene Cysteinyl 1 CYSLTR1 HUMAN::Q9Y271
Residue:
337
  
Inhibitor
Name:
BDBM50069356
Synonyms:
(R)-2-(1-((3-(2-(2-hydroxypropan-2-yl)phenyl)-1-(3-(2-(5,6,7,8-tetrahydroquinolin-2-yl)vinyl)phenyl)propylthio)methyl)cyclopropyl)acetic acid [1-((R)-3-[2-(1-Hydroxy-1-methyl-ethyl)-phenyl]-1-{3-[(E)-2-(5,6,7,8-tetrahydro-quinolin-2-yl)-vinyl]-phenyl}-propylsulfanylmethyl)-cyclopropyl]-acetic acid
Type:
Small organic molecule
Emp. Form.:
C35H41NO3S
Mol. Mass.:
555.77
SMILES:
CC(C)(O)c1ccccc1CC[C@@H](SCC1(CC(O)=O)CC1)c1cccc(\C=C\c2ccc3CCCCc3n2)c1
: