Target
Cysteinyl leukotriene receptor 1/2
Ligand
BDBM50069354
Substrate
Meas. Tech.
ChEMBL_99858 (CHEMBL706928)
IC50
0.730000±n/a nM
Citation
 Guay, DGauthier, JYDufresne, CJones, TRMcAuliffe, MMcFarlane, CMetters, KMPrasit, PRochette, CRoy, PSawyer, NZamboni, R A series of non-quinoline cysLT1 receptor antagonists: SAR study on pyridyl analogs of Singulair. Bioorg Med Chem Lett 8:453-8 (1999)  
Target
Name:
Cysteinyl leukotriene receptor 1/2
Synonyms:
Cysteinyl leukotriene receptor
Type:
Mol. Mass.:
Description:
ASSAY_ID of ChEMBL is 98640
Components:
This complex has 2 components.
Component 1
Name:
Cysteinyl leukotriene receptor 1
Synonyms:
CLTR1_HUMAN CYSLTR1 Cysteinyl leukotriene receptor HG55 LTD4 receptor | Leukotriene Cysteinyl 1
Type:
Enzyme Catalytic Domain
Mol. Mass.:
38565.16
Organism:
Homo sapiens (Human)
Description:
Leukotriene Cysteinyl 1 CYSLTR1 HUMAN::Q9Y271
Residue:
337
  
Component 2
Name:
Cysteinyl leukotriene receptor 2
Synonyms:
CLTR2_HUMAN CYSLT2R Cysteinyl leukotriene receptor Leukotriene Cysteinyl 2
Type:
Enzyme Catalytic Domain
Mol. Mass.:
39657.52
Organism:
Homo sapiens (Human)
Description:
Leukotriene Cysteinyl 2 CYSLTR2 HUMAN::Q9NS75
Residue:
346
  
Inhibitor
Name:
BDBM50069354
Synonyms:
CHEMBL141405 | [1-((R)-3-[2-(1-Hydroxy-1-methyl-ethyl)-phenyl]-1-{3-[(E)-2-(7-methyl-6,7-dihydro-5H-[1]pyrindin-2-yl)-vinyl]-phenyl}-propylsulfanylmethyl)-cyclopropyl]-acetic acid
Type:
Small organic molecule
Emp. Form.:
C35H41NO3S
Mol. Mass.:
555.77
SMILES:
CC1CCc2ccc(\C=C\c3cccc(c3)[C@@H](CCc3ccccc3C(C)(C)O)SCC3(CC(O)=O)CC3)nc12
: