Target
Neuropeptide Y receptor type 1
Ligand
BDBM50069422
Substrate
Meas. Tech.
ChEBML_144140
Ki
1630±n/a nM
Citation
 Zimmerman, DMCantrell, BESmith, ECNixon, JABruns, RFGitter, BHipskind, PAOrnstein, PLZarrinmayeh, HBritton, TCSchober, DAGehlert, DR Structure-activity relationships of a series of 1-substituted-4-methylbenzimidazole neuropeptide Y-1 receptor antagonists. Bioorg Med Chem Lett 8:473-6 (1999)  
Target
Name:
Neuropeptide Y receptor type 1
Synonyms:
NPY-Y1 NPY1R NPYR neuropeptide Y receptor Y1
Type:
Enzyme Catalytic Domain
Mol. Mass.:
44399.07
Organism:
Homo sapiens (Human)
Description:
NPY-Y1 NPY1R HUMAN::P25929
Residue:
384
  
Inhibitor
Name:
BDBM50069422
Synonyms:
4-(4-{3-[2-(4-Chloro-phenoxymethyl)-4-methyl-benzoimidazol-1-yl]-propyl}-piperidin-1-yl)-butyric acid | CHEMBL146116
Type:
Small organic molecule
Emp. Form.:
C27H34ClN3O3
Mol. Mass.:
484.03
SMILES:
Cc1cccc2n(CCCC3CCN(CCCC(O)=O)CC3)c(COc3ccc(Cl)cc3)nc12
: