Target
Toll-like receptor 8
Ligand
BDBM50514792
Substrate
Meas. Tech.
ChEMBL_1858567 (CHEMBL4359296)
Kd
225±n/a nM
Citation
 Jiang, STanji, HYin, KZhang, SSakaniwa, KHuang, JYang, YLi, JOhto, UShimizu, TYin, H Rationally Designed Small-Molecule Inhibitors Targeting an Unconventional Pocket on the TLR8 Protein-Protein Interface. J Med Chem 63:4117-4132 (2020)  
Target
Name:
Toll-like receptor 8
Synonyms:
CD_antigen: CD288 TLR8_HUMAN | TRL8
Type:
Enzyme
Mol. Mass.:
119828.77
Organism:
Homo sapiens (Human)
Description:
Q9NR97
Residue:
1041
  
Inhibitor
Name:
BDBM50514792
Synonyms:
CHEMBL4519240
Type:
Small organic molecule
Emp. Form.:
C15H21N3OS
Mol. Mass.:
291.412
SMILES:
CSc1nnc(CCCO)n1-c1cc(C)c(C)c(C)c1
: