Target
Peroxisome proliferator-activated receptor delta
Ligand
BDBM50514827
Substrate
Meas. Tech.
ChEMBL_1858611 (CHEMBL4359340)
EC50
810±n/a nM
Citation
 Hanke, TCheung, SYKilu, WHeering, JNi, XPlanz, VSchierle, SFaudone, GFriedrich, MWanior, MWerz, OWindbergs, MProschak, ESchubert-Zsilavecz, MChaikuad, AKnapp, SMerk, D A Selective Modulator of Peroxisome Proliferator-Activated Receptor ? with an Unprecedented Binding Mode. J Med Chem 63:4555-4561 (2020)  
Target
Name:
Peroxisome proliferator-activated receptor delta
Synonyms:
NR1C2 NUCI Nuclear receptor subfamily 1 group C member 2 PPAR-beta PPARD Peroxisome proliferator-activated receptor Peroxisome proliferator-activated receptor delta
Type:
Enzyme
Mol. Mass.:
49910.45
Organism:
Homo sapiens (Human)
Description:
Q03181
Residue:
441
  
Inhibitor
Name:
BDBM50514827
Synonyms:
CHEMBL4445084
Type:
Small organic molecule
Emp. Form.:
C21H22Cl2N2O4S3
Mol. Mass.:
533.511
SMILES:
CCCCCC[C@@H](Sc1nc2ccc(NS(=O)(=O)c3ccc(Cl)cc3Cl)cc2s1)C(O)=O
: