Target
Interleukin-1 receptor-associated kinase 4
Ligand
BDBM50514935
Substrate
Meas. Tech.
ChEMBL_1859084 (CHEMBL4359940)
Ki
1.1±n/a nM
Citation
 Bryan, MCDrobnick, JGobbi, AKolesnikov, AChen, YRajapaksa, NNdubaku, CFeng, JChang, WFrancis, RYu, CChoo, EFDeMent, KRan, YAn, LEmson, CHuang, ZSujatha-Bhaskar, SBrightbill, HDiPasquale, AMaher, JWai, JMcKenzie, BSLupardus, PJZarrin, AAKiefer, JR Development of Potent and Selective Pyrazolopyrimidine IRAK4 Inhibitors. J Med Chem 62:6223-6240 (2019)  
Target
Name:
Interleukin-1 receptor-associated kinase 4
Synonyms:
IRAK-4 IRAK4_HUMAN Interleukin-1 receptor-associated kinase 4 (IRAK4) | Renal carcinoma antigen NY-REN-64
Type:
Protein
Mol. Mass.:
51519.08
Organism:
Homo sapiens (Human)
Description:
Q9NWZ3
Residue:
460
  
Inhibitor
Name:
BDBM50514935
Synonyms:
CHEMBL4520118 | US10988478, Example 491
Type:
Small organic molecule
Emp. Form.:
C22H24N6O4
Mol. Mass.:
436.4638
SMILES:
CC1(C)Cc2cc(NC(=O)c3cnn4cc(cnc34)C(N)=O)c(cc2O1)N1CCOCC1
: