Target
Oxysterols receptor LXR-beta
Ligand
BDBM50177015
Substrate
Meas. Tech.
ChEMBL_1859653 (CHEMBL4360509)
Ki
1.3±n/a nM
Citation
 Zhang, ZChen, HChen, ZDing, PJu, YGu, QXu, JZhou, H Identify liver X receptor ? modulator building blocks by developing a fluorescence polarization-based competition assay. Eur J Med Chem 178:458-467 (2019)  
Target
Name:
Oxysterols receptor LXR-beta
Synonyms:
LXRB Liver X, LXR beta NR1H2 Nuclear receptor NER Ubiquitously-expressed nuclear receptor
Type:
Enzyme Catalytic Domain
Mol. Mass.:
50978.79
Organism:
Homo sapiens (Human)
Description:
P55055
Residue:
460
  
Inhibitor
Name:
BDBM50177015
Synonyms:
CHEMBL3814206 | US10144715, Compound 19-1
Type:
Small organic molecule
Emp. Form.:
C21H27F3N4O4S
Mol. Mass.:
488.524
SMILES:
CC(C)[C@@H]1CN(CCN1c1ncc(CO)c(n1)C(F)(F)F)c1ccc(CO)c(c1)S(C)(=O)=O
: