Target
Oxysterols receptor LXR-beta
Ligand
BDBM23448
Substrate
Meas. Tech.
ChEMBL_1859653 (CHEMBL4360509)
Ki
66000±n/a nM
Citation
 Zhang, ZChen, HChen, ZDing, PJu, YGu, QXu, JZhou, H Identify liver X receptor ? modulator building blocks by developing a fluorescence polarization-based competition assay. Eur J Med Chem 178:458-467 (2019)  
Target
Name:
Oxysterols receptor LXR-beta
Synonyms:
LXRB Liver X, LXR beta NR1H2 Nuclear receptor NER Ubiquitously-expressed nuclear receptor
Type:
Enzyme Catalytic Domain
Mol. Mass.:
50978.79
Organism:
Homo sapiens (Human)
Description:
P55055
Residue:
460
  
Inhibitor
Name:
BDBM23448
Synonyms:
BUTYLPARABEN Nipabutyl cid_7184
Type:
Small organic molecule
Emp. Form.:
C11H14O3
Mol. Mass.:
194.2271
SMILES:
CCCCOC(=O)c1ccc(O)cc1
: