Target
Oxysterols receptor LXR-beta
Ligand
BDBM93021
Substrate
Meas. Tech.
ChEMBL_1859653 (CHEMBL4360509)
Ki
302000±n/a nM
Citation
 Zhang, ZChen, HChen, ZDing, PJu, YGu, QXu, JZhou, H Identify liver X receptor ? modulator building blocks by developing a fluorescence polarization-based competition assay. Eur J Med Chem 178:458-467 (2019)  
Target
Name:
Oxysterols receptor LXR-beta
Synonyms:
LXRB Liver X, LXR beta NR1H2 Nuclear receptor NER Ubiquitously-expressed nuclear receptor
Type:
Enzyme Catalytic Domain
Mol. Mass.:
50978.79
Organism:
Homo sapiens (Human)
Description:
P55055
Residue:
460
  
Inhibitor
Name:
BDBM93021
Synonyms:
Indole-6-carboxylate | Indole-7-carboxylate
Type:
Small molecule
Emp. Form.:
C10H9NO2
Mol. Mass.:
175.184
SMILES:
COC(=O)c1ccc2cc[nH]c2c1
: