Target
Gag-Pol polyprotein [489-587]
Ligand
BDBM548
Substrate
Meas. Tech.
ChEBML_159291
IC50
500±n/a nM
Citation
 Janakiraman, MNWatenpaugh, KDTomich, PKChong, KTTurner, SRTommasi, RAThaisrivongs, SStrohbach, JW Non-peptidic HIV protease inhibitors: C2-symmetry-based design of bis-sulfonamide dihydropyrones. Bioorg Med Chem Lett 8:1237-42 (1999)  
Target
Name:
Gag-Pol polyprotein [489-587]
Synonyms:
Human immunodeficiency virus type 1 protease Pol polyprotein | gag-pol
Type:
Enzyme Subunit
Mol. Mass.:
10781.16
Organism:
Human immunodeficiency virus type 1
Description:
P04585[489-587]
Residue:
99
  
Inhibitor
Name:
BDBM548
Synonyms:
CHEMBL21188 Sulfonamide-Containing 5,6-Dihydro-4-hydroxy-2-pyrones | Tipranavir analog 5
Type:
Small organic molecule
Emp. Form.:
C29H35N3O5S
Mol. Mass.:
537.67
SMILES:
CCCC1(CCc2ccccc2)CC(=O)C(C(CC)c2cccc(NS(=O)(=O)c3cn(C)cn3)c2)C(=O)O1
: