Target
5-hydroxytryptamine receptor 2A
Ligand
BDBM50070514
Substrate
Meas. Tech.
ChEBML_2244
Ki
15±n/a nM
Citation
 Belliotti, TRBrink, WAKesten, SRRubin, JRWustrow, DJZoski, KTWhetzel, SZCorbin, AEPugsley, TAHeffner, TGWise, LD Isoindolinone enantiomers having affinity for the dopamine D4 receptor. Bioorg Med Chem Lett 8:1499-502 (1999)  
Target
Name:
5-hydroxytryptamine receptor 2A
Synonyms:
5-HT2A 5HTR2A Serotonin 2a (5-HT2a) receptor
Type:
Enzyme Catalytic Domain
Mol. Mass.:
52578.24
Organism:
BOVINE
Description:
5-HT2A HTR2A BOVINE::Q75Z89
Residue:
470
  
Inhibitor
Name:
BDBM50070514
Synonyms:
(S)-3-{2-[4-(3,4-Dimethyl-phenyl)-piperazin-1-yl]-ethyl}-2,3-dihydro-isoindol-1-one CHEMBL37170 PD-18126
Type:
Small organic molecule
Emp. Form.:
C22H27N3O
Mol. Mass.:
349.4693
SMILES:
Cc1ccc(cc1C)N1CCN(CC[C@@H]2NC(=O)c3ccccc23)CC1
: