Target
Thioredoxin reductase 1, cytoplasmic
Ligand
BDBM50515527
Substrate
Meas. Tech.
ChEMBL_1861479 (CHEMBL4362335)
IC50
51240±n/a nM
Citation
 Jovanovi?, MZhukovsky, DPodolski-Reni?, ADomra?eva, I?alubovskis, RSen?anski, MGli?i?, SSharoyko, VTennikova, TDar'in, DPe?i?, MKrasavin, M Novel electrophilic amides amenable by the Ugi reaction perturb thioredoxin system via thioredoxin reductase 1 (TrxR1) inhibition: Identification of DVD-445 as a new lead compound for anticancer therapy. Eur J Med Chem 181:0 (2019)  
Target
Name:
Thioredoxin reductase 1, cytoplasmic
Synonyms:
GRIM-12 Gene associated with retinoid-IFN-induced mortality 12 protein KM-102-derived reductase-like factor TRXR1_HUMAN Thioredoxin reductase 1 Thioredoxin reductase TR1
Type:
Protein
Mol. Mass.:
70761.78
Organism:
Homo sapiens (Human)
Description:
Q16881
Residue:
648
  
Inhibitor
Name:
BDBM50515527
Synonyms:
CHEMBL4451049
Type:
Small organic molecule
Emp. Form.:
C32H40N2O4
Mol. Mass.:
516.671
SMILES:
COc1ccccc1C(N(C1CCCCC1)C(=O)\C=C\C(=O)c1ccc(C)cc1)C(=O)NC1CCCCC1
: