Target
Thioredoxin reductase 1, cytoplasmic
Ligand
BDBM50515537
Substrate
Meas. Tech.
ChEMBL_1861480 (CHEMBL4362336)
IC50
1250±n/a nM
Citation
 Jovanovi?, MZhukovsky, DPodolski-Reni?, ADomra?eva, I?alubovskis, RSen?anski, MGli?i?, SSharoyko, VTennikova, TDar'in, DPe?i?, MKrasavin, M Novel electrophilic amides amenable by the Ugi reaction perturb thioredoxin system via thioredoxin reductase 1 (TrxR1) inhibition: Identification of DVD-445 as a new lead compound for anticancer therapy. Eur J Med Chem 181:0 (2019)  
Target
Name:
Thioredoxin reductase 1, cytoplasmic
Synonyms:
NADPH-dependent thioredoxin reductase TRXR1_RAT Trxr1 | Txnrd1
Type:
PROTEIN
Mol. Mass.:
54519.34
Organism:
Rattus norvegicus
Description:
ChEMBL_589950
Residue:
498
  
Inhibitor
Name:
BDBM50515537
Synonyms:
CHEMBL4589636
Type:
Small organic molecule
Emp. Form.:
C30H39FN2O6
Mol. Mass.:
542.6389
SMILES:
COc1cc(cc(OC)c1OC)C(N(CCC(C)C)C(=O)\C=C\C(=O)c1ccc(F)cc1)C(=O)NC(C)(C)C
: