Target
Cannabinoid receptor 1
Ligand
BDBM50071413
Substrate
Meas. Tech.
ChEBML_46289
Ki
0.490000±n/a nM
Citation
 Liddle, JHuffman, JWWiley, JLMartin, BR Enantioselective synthesis and pharmacology of 11-hydroxy-(1'S,2'R)-dimethylheptyl-delta 8-THC. Bioorg Med Chem Lett 8:2223-6 (1999)  
Target
Name:
Cannabinoid receptor 1
Synonyms:
Brain-type cannabinoid receptor CB-R CNR1_RAT Cannabinoid receptor Cnr1 | Skr6
Type:
G Protein-Coupled Receptor (GPCR)
Mol. Mass.:
52856.55
Organism:
Rattus norvegicus (rat)
Description:
P20272
Residue:
473
  
Inhibitor
Name:
BDBM50071413
Synonyms:
(6aR,10aR)-3-((1S,2R)-1,2-Dimethyl-heptyl)-9-hydroxymethyl-6,6-dimethyl-6a,7,10,10a-tetrahydro-6H-benzo[c]chromen-1-ol | CHEMBL73060
Type:
Small organic molecule
Emp. Form.:
C25H38O3
Mol. Mass.:
386.5674
SMILES:
CCCCC[C@@H](C)[C@H](C)c1cc(O)c2[C@@H]3CC(CO)=CC[C@H]3C(C)(C)Oc2c1
: