Target
Endothelin receptor type B
Ligand
BDBM50071444
Substrate
Meas. Tech.
ChEBML_64012
Ki
0.490000±n/a nM
Citation
 Sakaki, JMurata, TYuumoto, YNakamura, ITrueh, TPitterna, TIwasaki, GOda, KYamamura, THayakawa, K Discovery of IRL 3461: a novel and potent endothelin antagonist with balanced ETA/ETB affinity. Bioorg Med Chem Lett 8:2241-6 (1999)  
Target
Name:
Endothelin receptor type B
Synonyms:
EDNRB ENDOTHELIN B ETRB Endothelin receptor non-selective type | Endothelin receptor, ET-A/ET-B
Type:
Enzyme Catalytic Domain
Mol. Mass.:
49664.00
Organism:
Homo sapiens (Human)
Description:
ENDOTHELIN B EDNRB HUMAN::P24530
Residue:
442
  
Inhibitor
Name:
BDBM50071444
Synonyms:
CHEMBL307045 | N-[(R)-1-[1-(Butane-1-sulfonylaminocarbonyl)-3-methylsulfanyl-propylcarbamoyl]-2-(4-isoxazol-5-yl-phenyl)-ethyl]-3,5,N-trimethyl-benzamide
Type:
Small organic molecule
Emp. Form.:
C31H40N4O6S2
Mol. Mass.:
628.803
SMILES:
CCCCS(=O)(=O)NC(=O)C(CCSC)NC(=O)[C@@H](Cc1ccc(cc1)-c1ccno1)N(C)C(=O)c1cc(C)cc(C)c1
: