Target
Histamine H3 receptor
Ligand
BDBM22914
Substrate
Meas. Tech.
ChEBML_85851
Ki
7.3±n/a nM
Citation
 Aslanian, RBrown, JEShih, NYwa Mutahi, MGreen, MJShe, SDel Prado, MWest, RHey, J 4-[(1H-imidazol-4-yl) methyl] benzamidines and benzylamidines: novel antagonists of the histamine H3 receptor. Bioorg Med Chem Lett 8:2263-8 (1999)  
Target
Name:
Histamine H3 receptor
Synonyms:
HISTAMINE H3 HRH3_CAVPO | Histamine H3 receptor
Type:
Enzyme Catalytic Domain
Mol. Mass.:
48753.61
Organism:
GUINEA PIG
Description:
HISTAMINE H3 HRH3 GUINEA PIG::Q9JI35
Residue:
445
  
Inhibitor
Name:
BDBM22914
Synonyms:
CHEMBL260374 Thioperamide | US11622967, Compound Thioperamide
Type:
Small organic molecule
Emp. Form.:
C15H24N4S
Mol. Mass.:
292.443
SMILES:
S=C(NC1CCCCC1)N1CCC(CC1)c1cnc[nH]1
: