Target
Cannabinoid receptor 1
Ligand
BDBM50072771
Substrate
Meas. Tech.
ChEMBL_46802 (CHEMBL659689)
Ki
21000±n/a nM
Citation
 Lin, SKhanolkar, ADFan, PGoutopoulos, AQin, CPapahadjis, DMakriyannis, A Novel analogues of arachidonylethanolamide (anandamide): affinities for the CB1 and CB2 cannabinoid receptors and metabolic stability. J Med Chem 41:5353-61 (1999)  
Target
Name:
Cannabinoid receptor 1
Synonyms:
Brain-type cannabinoid receptor CB-R CNR1_RAT Cannabinoid receptor Cnr1 | Skr6
Type:
G Protein-Coupled Receptor (GPCR)
Mol. Mass.:
52856.55
Organism:
Rattus norvegicus (rat)
Description:
P20272
Residue:
473
  
Inhibitor
Name:
BDBM50072771
Synonyms:
(9Z,12Z)-Octadeca-9,12-dienoic acid ((R)-2-hydroxy-1-methyl-ethyl)-amide | CHEMBL356213
Type:
Small organic molecule
Emp. Form.:
C21H39NO2
Mol. Mass.:
337.5399
SMILES:
CCCCC\C=C/C\C=C/CCCCCCCC(=O)N[C@H](C)CO
: