Target
Muscarinic acetylcholine receptor M4
Ligand
BDBM50518725
Substrate
Meas. Tech.
ChEMBL_1872177 (CHEMBL4373344)
EC50
5600±n/a nM
Citation
 Poslusney, MSSalovich, JMWood, MRMelancon, BJBollinger, KALuscombe, VBRodriguez, ALEngers, DWBridges, TMNiswender, CMConn, PJLindsley, CW Novel M Bioorg Med Chem Lett 29:362-366 (2019)  
Target
Name:
Muscarinic acetylcholine receptor M4
Synonyms:
ACM4_HUMAN Cholinergic, muscarinic M4 Muscarinic acetylcholine receptor M2 and M4
Type:
Enzyme Catalytic Domain
Mol. Mass.:
53079.31
Organism:
Homo sapiens (Human)
Description:
Cholinergic, muscarinic M4 CHRM4 HUMAN M3::P08173
Residue:
479
  
Inhibitor
Name:
BDBM50518725
Synonyms:
CHEMBL4466551
Type:
Small organic molecule
Emp. Form.:
C20H20FN3O2S
Mol. Mass.:
385.455
SMILES:
COc1ccc(CNC(=O)c2sc3nnc(C)c(C)c3c2C2CC2)cc1F
: