Target
Cytochrome P450 1A2
Ligand
BDBM28583
Substrate
Meas. Tech.
ChEMBL_52551 (CHEMBL666250)
IC50
66000±n/a nM
Citation
 Bromidge, SMBrown, AMClarke, SEDodgson, KGager, TGrassam, HLJeffrey, PMJoiner, GFKing, FDMiddlemiss, DNMoss, SFNewman, HRiley, GRoutledge, CWyman, P 5-Chloro-N-(4-methoxy-3-piperazin-1-yl- phenyl)-3-methyl-2-benzothiophenesulfon- amide (SB-271046): a potent, selective, and orally bioavailable 5-HT6 receptor antagonist. J Med Chem 42:202-5 (1999)  
Target
Name:
Cytochrome P450 1A2
Synonyms:
CP1A2_HUMAN CYPIA2 Cytochrome P(3)450 Cytochrome P450 1A2 (CYP1A2) Cytochrome P450-P3
Type:
Enzyme
Mol. Mass.:
58423.38
Organism:
Homo sapiens (Human)
Description:
P05177
Residue:
516
  
Inhibitor
Name:
BDBM28583
Synonyms:
5-chloro-N-[4-methoxy-3-(piperazin-1-yl)phenyl]-3-methyl-1-benzothiophene-2-sulfonamide hydrochloride SB 271046 | SB-271046
Type:
Small organic molecule
Emp. Form.:
C20H22ClN3O3S2
Mol. Mass.:
451.99
SMILES:
COc1ccc(NS(=O)(=O)c2sc3ccc(Cl)cc3c2C)cc1N1CCNCC1
: