Target
Epidermal growth factor receptor
Ligand
BDBM50185140
Substrate
Meas. Tech.
ChEMBL_1873760 (CHEMBL4375049)
IC50
3.0±n/a nM
Citation
 Shen, JZhang, TZhu, SJSun, MTong, LLai, MZhang, RXu, WWu, RDing, JYun, CHXie, HLu, XDing, K Structure-Based Design of 5-Methylpyrimidopyridone Derivatives as New Wild-Type Sparing Inhibitors of the Epidermal Growth Factor Receptor Triple Mutant (EGFR J Med Chem 62:7302-7308 (2019)  
Target
Name:
Epidermal growth factor receptor
Synonyms:
EGF Receptor Substrate EGFR_HUMAN ERBB1 Epidermal Growth Factor Receptor erbB-1 Epidermal growth factor receptor (EGFR) HER1 Proto-oncogene c-ErbB-1 Tyrosine-Protein Kinase ErbB-1
Type:
Receptor Kinase Domain
Mol. Mass.:
134279.59
Organism:
Homo sapiens (Human)
Description:
P00533
Residue:
1210
  
Inhibitor
Name:
BDBM50185140
Synonyms:
AP-26113 US11248003, Example Brigatinib | US20230322822, Compound Brigatinib
Type:
Small organic molecule
Emp. Form.:
C29H39ClN7O2P
Mol. Mass.:
584.092
SMILES:
COc1cc(ccc1Nc1ncc(Cl)c(Nc2ccccc2P(C)(C)=O)n1)N1CCC(CC1)N1CCN(C)CC1
: