Target
Mu-type opioid receptor
Ligand
BDBM50073519
Substrate
Meas. Tech.
ChEMBL_148515 (CHEMBL759051)
Ki
0.5±n/a nM
Citation
 Negri, LLattanzi, RTabacco, FOrrù, LSeverini, CScolaro, BRocchi, R Dermorphin and deltorphin glycosylated analogues: synthesis and antinociceptive activity after systemic administration. J Med Chem 42:400-4 (1999)  
Target
Name:
Mu-type opioid receptor
Synonyms:
M-OR-1 Mor OPRM_MOUSE Oprm | Oprm1
Type:
Enzyme Catalytic Domain
Mol. Mass.:
44431.62
Organism:
MOUSE
Description:
OPIATE Mu OPRM1 MOUSE::P42866
Residue:
398
  
Inhibitor
Name:
BDBM50073519
Synonyms:
(S)-1-[(S)-2-[2-((S)-2-{(R)-2-[(S)-2-Amino-3-(4-hydroxy-phenyl)-propionylamino]-propionylamino}-3-phenyl-propionylamino)-acetylamino]-3-(4-hydroxy-phenyl)-propionyl]-4-hydroxy-pyrrolidine-2-carboxylic acid ((S)-5-amino-1-carbamoyl-pentyl)-amide | CHEMBL131558
Type:
Small organic molecule
Emp. Form.:
C43H57N9O10
Mol. Mass.:
859.967
SMILES:
C[C@@H](NC(=O)[C@@H](N)Cc1ccc(O)cc1)C(=O)N[C@@H](Cc1ccccc1)C(=O)NCC(=O)N[C@@H](Cc1ccc(O)cc1)C(=O)N1CC(O)C[C@H]1C(=O)N[C@@H](CCCCN)C(N)=O
: