Target
Carbonic anhydrase 12
Ligand
BDBM29278
Substrate
Meas. Tech.
ChEMBL_1878478 (CHEMBL4379872)
Ki
633±n/a nM
Citation
 Bua, SLomelino, CMurray, ABOsman, SMALOthman, ZABozdag, MAbdel-Aziz, HAEldehna, WMMcKenna, RNocentini, ASupuran, CT "A Sweet Combination": Developing Saccharin and Acesulfame K Structures for Selectively Targeting the Tumor-Associated Carbonic Anhydrases IX and XII. J Med Chem 63:321-333 (2020)  
Target
Name:
Carbonic anhydrase 12
Synonyms:
CA-XII CAH12_HUMAN Carbonic anhydrase Carbonic anhydrase XII Carbonic anhydrase XII (CAXII) | Tumor antigen HOM-RCC-3.1.3
Type:
Enzyme
Mol. Mass.:
39456.00
Organism:
Homo sapiens (Human)
Description:
Catalytic domain of human cloned isozyme was used in the assay
Residue:
354
  
Inhibitor
Name:
BDBM29278
Synonyms:
CHEMBL310671 SAC Saccharin
Type:
Small organic molecule
Emp. Form.:
C7H5NO3S
Mol. Mass.:
183.185
SMILES:
O=C1NS(=O)(=O)c2ccccc12
: