Target
Growth factor receptor-bound protein 2
Ligand
BDBM50073912
Substrate
Meas. Tech.
ChEBML_66902
IC50
9.2±n/a nM
Citation
 Schoepfer, JFretz, HGay, BFuret, PGarcía-Echeverría, CEnd, NCaravatti, G Highly potent inhibitors of the Grb2-SH2 domain. Bioorg Med Chem Lett 9:221-6 (1999)  
Target
Name:
Growth factor receptor-bound protein 2
Synonyms:
ASH GRB2 adapter protein Grb2-SH2 | Growth factor receptor-bound protein 2
Type:
Protein
Mol. Mass.:
25205.04
Organism:
Homo sapiens (Human)
Description:
P62993
Residue:
217
  
Inhibitor
Name:
BDBM50073912
Synonyms:
CHEMBL72996 | {4-[(S)-2-Acetylamino-2-(1-{(S)-2-carbamoyl-1-[3-(1-methyl-1H-indol-3-yl)-propylcarbamoyl]-ethylcarbamoyl}-cyclohexylcarbamoyl)-ethyl]-benzyl}-phosphonic acid
Type:
Small organic molecule
Emp. Form.:
C35H47N6O8P
Mol. Mass.:
710.7568
SMILES:
CC(=O)N[C@@H](Cc1ccc(CP(O)(O)=O)cc1)C(=O)NC1(CCCCC1)C(=O)N[C@@H](CC(N)=O)C(=O)NCCCc1cn(C)c2ccccc12
: