Target
Growth factor receptor-bound protein 2
Ligand
BDBM50073917
Substrate
Meas. Tech.
ChEBML_66902
IC50
0.900000±n/a nM
Citation
 Schoepfer, JFretz, HGay, BFuret, PGarcía-Echeverría, CEnd, NCaravatti, G Highly potent inhibitors of the Grb2-SH2 domain. Bioorg Med Chem Lett 9:221-6 (1999)  
Target
Name:
Growth factor receptor-bound protein 2
Synonyms:
ASH GRB2 adapter protein Grb2-SH2 | Growth factor receptor-bound protein 2
Type:
Protein
Mol. Mass.:
25205.04
Organism:
Homo sapiens (Human)
Description:
P62993
Residue:
217
  
Inhibitor
Name:
BDBM50073917
Synonyms:
CHEMBL72694 | {4-[(S)-2-Acetylamino-2-(1-{(S)-2-carbamoyl-1-[3-(5-methoxy-indol-1-yl)-propylcarbamoyl]-ethylcarbamoyl}-cyclohexylcarbamoyl)-ethyl]-benzyl}-phosphonic acid
Type:
Small organic molecule
Emp. Form.:
C35H47N6O9P
Mol. Mass.:
726.7562
SMILES:
COc1ccc2n(CCCNC(=O)[C@H](CC(N)=O)NC(=O)C3(CCCCC3)NC(=O)[C@H](Cc3ccc(CP(O)(O)=O)cc3)NC(C)=O)ccc2c1
: