Target
Chymotrypsinogen B2
Ligand
BDBM50520061
Substrate
Meas. Tech.
ChEMBL_1879019 (CHEMBL4380413)
Ki
920±n/a nM
Citation
 Li, CYYap, KSwedberg, JECraik, DJde Veer, SJ Binding Loop Substitutions in the Cyclic Peptide SFTI-1 Generate Potent and Selective Chymase Inhibitors. J Med Chem 63:816-826 (2020)  
Target
Name:
Chymotrypsinogen B2
Synonyms:
3.4.21.1 CTRB2_HUMAN Chymotrypsin B2 chain B Chymotrypsinogen B2
Type:
PROTEIN
Mol. Mass.:
27926.36
Organism:
Homo sapiens
Description:
ChEMBL_119704
Residue:
263
  
Inhibitor
Name:
BDBM50520061
Synonyms:
CHEMBL4556207
Type:
Small organic molecule
Emp. Form.:
C69H93N19O24S2
Mol. Mass.:
1636.72
SMILES:
NC(=O)CC[C@@H]1NC(=O)[C@@H]2CSSC[C@H](NC(=O)[C@H](CCC(O)=O)NC(=O)[C@@H]3CCCN3C(=O)[C@@H]3CCCN3C(=O)[C@H](CCC(O)=O)NC(=O)[C@H](CO)NC(=O)[C@H](Cc3ccc(cc3)[N+]([O-])=O)NC1=O)C(=O)N[C@@H](Cc1ccccc1)C(=O)N1CCC[C@H]1C(=O)N[C@@H](CC(O)=O)C(=O)NCC(=O)N[C@@H](CCCNC(N)=N)C(=O)N2
: