Target
Epidermal growth factor receptor
Ligand
BDBM50520827
Substrate
Meas. Tech.
ChEMBL_1882259 (CHEMBL4383758)
IC50
6600±n/a nM
Citation
 Zhou, PChen, GGao, MWu, J Design, synthesis and evaluation of the osimertinib analogue (C-005) as potent EGFR inhibitor against NSCLC. Bioorg Med Chem 26:6135-6145 (2018)  
Target
Name:
Epidermal growth factor receptor
Synonyms:
EGF Receptor Substrate EGFR_HUMAN ERBB1 Epidermal Growth Factor Receptor erbB-1 Epidermal growth factor receptor (EGFR) HER1 Proto-oncogene c-ErbB-1 Tyrosine-Protein Kinase ErbB-1
Type:
Receptor Kinase Domain
Mol. Mass.:
134279.59
Organism:
Homo sapiens (Human)
Description:
P00533
Residue:
1210
  
Inhibitor
Name:
BDBM50520827
Synonyms:
CHEMBL4536146
Type:
Small organic molecule
Emp. Form.:
C26H30N8O2
Mol. Mass.:
486.5688
SMILES:
CNCCN(C)c1cc(OC)c(Nc2nccc(n2)-c2cn(C)c3cccnc23)cc1NC(=O)C=C
: