Target
Cyclin-A2/Cyclin-dependent kinase 2
Ligand
BDBM50154937
Substrate
Meas. Tech.
ChEMBL_1884565 (CHEMBL4386147)
IC50
144±n/a nM
Citation
 Jorda, RHavlí?ek, L?turc, ATu?ková, DDaumová, LAlam, M?kerlová, JNekardová, MPe?ina, MPospí?il, T?iroká, JUrbánek, LPachl, P?ezá?ová, PStrnad, MKlener, PKry?tof, V 3,5,7-Substituted Pyrazolo[4,3- d]pyrimidine Inhibitors of Cyclin-Dependent Kinases and Their Evaluation in Lymphoma Models. J Med Chem 62:4606-4623 (2019)  
Target
Name:
Cyclin-A2/Cyclin-dependent kinase 2
Synonyms:
CDK2-CyclinA CDK2/Cyclin A Cyclin A2/dependent kinase 2 Cyclin-Dependent Kinase 2 (CDK2A)
Type:
Protein Complex
Mol. Mass.:
Description:
Cdk2/Cyclin A kinase was purified from insect cells coinfected with Cyclin A/Cdk2 baculovirus.
Components:
This complex has 2 components.
Component 1
Name:
Cyclin-dependent kinase 2
Synonyms:
CDK2 CDK2_HUMAN Cell division protein kinase 2 Protein cereblon/Cyclin-dependent kinase 2 | p33 protein kinase
Type:
Enzyme Subunit
Mol. Mass.:
33938.17
Organism:
Homo sapiens (Human)
Description:
P24941
Residue:
298
  
Component 2
Name:
Cyclin-A2
Synonyms:
CCN1 CCNA1 CCNA2_HUMAN Cyclin-A
Type:
Enzyme Subunit
Mol. Mass.:
48550.19
Organism:
Homo sapiens (Human)
Description:
P20248
Residue:
432
  
Inhibitor
Name:
BDBM50154937
Synonyms:
CHEMBL518800
Type:
Small organic molecule
Emp. Form.:
C24H29N7O
Mol. Mass.:
431.5334
SMILES:
CC[C@H](CO)Nc1nc(NCc2ccc(cc2)-c2ccccn2)c2ncn(C(C)C)c2n1
: