Target
Sodium channel protein type 9 subunit alpha
Ligand
BDBM50521580
Substrate
Meas. Tech.
ChEMBL_1884747 (CHEMBL4386329)
Ki
1.5±n/a nM
Citation
 McKerrall, SJNguyen, TLai, KWBergeron, PDeng, LDiPasquale, AChang, JHChen, JChernov-Rogan, THackos, DHMaher, JOrtwine, DFPang, JPayandeh, JProctor, WRShields, SDVogt, JJi, PLiu, WBallini, ESchumann, LTarozzo, GBankar, GChowdhury, SHasan, AJohnson, JPKhakh, KLin, SCohen, CJDehnhardt, CMSafina, BSSutherlin, DP Structure- and Ligand-Based Discovery of Chromane Arylsulfonamide Na J Med Chem 62:4091-4109 (2019)  
Target
Name:
Sodium channel protein type 9 subunit alpha
Synonyms:
NENA Peripheral sodium channel 1 SCN9A_HUMAN Voltage-gated sodium channel subunit Nav1.7 hNE-Na
Type:
Protein
Mol. Mass.:
226375.97
Organism:
Homo sapiens (Human)
Description:
Q15858
Residue:
1988
  
Inhibitor
Name:
BDBM50521580
Synonyms:
CHEMBL4474681
Type:
Small organic molecule
Emp. Form.:
C23H22F4N6O3S
Mol. Mass.:
538.518
SMILES:
Fc1cc2[C@H](CCOc2cc1S(=O)(=O)Nc1ccncn1)N1CC[C@@H](C[C@@H]1c1ccncn1)C(F)(F)F
: