Target
Serine/threonine-protein kinase B-raf
Ligand
BDBM50521661
Substrate
Meas. Tech.
ChEMBL_1884973 (CHEMBL4386555)
Kd
780±n/a nM
Citation
 Beneker, CMRovoli, MKontopidis, GRöring, MGalda, SBraun, SBrummer, TMcInnes, C Design and Synthesis of Type-IV Inhibitors of BRAF Kinase That Block Dimerization and Overcome Paradoxical MEK/ERK Activation. J Med Chem 62:3886-3897 (2019)  
Target
Name:
Serine/threonine-protein kinase B-raf
Synonyms:
B-RAF B-Raf proto-oncogene serine/threonine-protein kinase BRAF1 RAFB1 v-Raf murine sarcoma viral oncogene homolog B1
Type:
Serine/threonine-protein kinase
Mol. Mass.:
84446.00
Organism:
Homo sapiens (Human)
Description:
P15056
Residue:
766
  
Inhibitor
Name:
BDBM50521661
Synonyms:
CHEMBL4457586
Type:
Small organic molecule
Emp. Form.:
C77H129N25O17S
Mol. Mass.:
1709.07
SMILES:
CSCC[C@@H]1NC(=O)[C@H](Cc2ccccc2)NC(=O)[C@H](CC(C)C)NC(=O)[C@H](CC(C)C)NC(=O)[C@H](CCC(O)=O)NC(=O)[C@H](CC(N)=O)NC(=O)[C@@H](NC(=O)[C@H](Cc2cnc[nH]2)NC(=O)[C@H](CCCNC(N)=N)NC(=O)C(CCCN)NC(=O)[C@H](CCCCN)NC(=O)[C@H](CCCNC(N)=N)NC(=O)[C@H](CC(C)C)NC(=O)CNC1=O)C(C)C
: