Target
Integrin alpha-IIb/beta-3
Ligand
BDBM50217532
Substrate
Meas. Tech.
ChEMBL_70777 (CHEMBL681995)
IC50
220±n/a nM
Citation
 Rockwell, ALRafalski, MPitts, WJBatt, DGPetraitis, JJDeGrado, WFMousa, SJadhav, PK Rapid synthesis of RGD mimetics with isoxazoline scaffolds on solid phase: identification of alphavbeta3 antagonists lead compounds. Bioorg Med Chem Lett 9:937-42 (1999)  
Target
Name:
Integrin alpha-IIb/beta-3
Synonyms:
Glycoprotein IIb/IIIa
Type:
Mol. Mass.:
Description:
ASSAY_ID of EBI is 30109
Components:
This complex has 2 components.
Component 1
Name:
Integrin beta-3
Synonyms:
CD_antigen=CD61 GPIIIa ITGB3 Platelet membrane glycoprotein IIIa
Type:
Protein
Mol. Mass.:
87038.91
Organism:
Homo sapiens (Human)
Description:
P05106
Residue:
788
  
Component 2
Name:
Integrin alpha-IIb
Synonyms:
CD_antigen=CD41 GPIIb Glycoprotein IIb ITGA2B Integrin alpha-IIb heavy chain Integrin alpha-IIb light chain, form 2 Integrin alpha-V/beta-3 and alpha-IIb/beta 3 | Platelet membrane glycoprotein IIb
Type:
Protein
Mol. Mass.:
113354.85
Organism:
Homo sapiens (Human)
Description:
P08514
Residue:
1039
  
Inhibitor
Name:
BDBM50217532
Synonyms:
CHEMBL3559597
Type:
Small organic molecule
Emp. Form.:
C17H27ClN8O6S
Mol. Mass.:
506.964
SMILES:
[#6]-c1cn(-[#6])[n+](Cl)c1S(=O)(=O)[#7]-[#6@@H](-[#6]-[#7]-[#6](=O)-[#6]-1=[#7]-[#8]-[#6](-[#6]-[#6]-[#6]-[#6]\[#7]=[#6](/[#7])-[#7])-[#6]-1)-[#6](-[#8-])=O
: