Target
Polyunsaturated fatty acid 5-lipoxygenase
Ligand
BDBM50076639
Substrate
Meas. Tech.
ChEMBL_4159 (CHEMBL619226)
IC50
11900±n/a nM
Citation
 Connolly, PJWetter, SKBeers, KNHamel, SCChen, RHWachter, MPAnsell, JSinger, MMSteber, MRitchie, DMArgentieri, DC N-hydroxyurea and hydroxamic acid inhibitors of cyclooxygenase and 5-lipoxygenase. Bioorg Med Chem Lett 9:979-84 (1999)  
Target
Name:
Polyunsaturated fatty acid 5-lipoxygenase
Synonyms:
Alox5 LOX5_RAT
Type:
PROTEIN
Mol. Mass.:
78082.31
Organism:
Rattus norvegicus
Description:
ChEMBL_1432947
Residue:
673
  
Inhibitor
Name:
BDBM50076639
Synonyms:
CHEMBL367010 | N-{3-[5-(4-Ethyl-phenyl)-1-(4-methoxy-phenyl)-1H-pyrazol-3-yl]-1-methyl-prop-2-ynyl}-N-hydroxy-acetamide
Type:
Small organic molecule
Emp. Form.:
C24H25N3O3
Mol. Mass.:
403.4736
SMILES:
CCc1ccc(cc1)-c1cc(nn1-c1ccc(OC)cc1)C#CC(C)N(O)C(C)=O
: