Target
Prostaglandin G/H synthase 1/2
Ligand
BDBM50076648
Substrate
Meas. Tech.
ChEMBL_51502 (CHEMBL665837)
IC50
1600±n/a nM
Citation
 Connolly, PJWetter, SKBeers, KNHamel, SCChen, RHWachter, MPAnsell, JSinger, MMSteber, MRitchie, DMArgentieri, DC N-hydroxyurea and hydroxamic acid inhibitors of cyclooxygenase and 5-lipoxygenase. Bioorg Med Chem Lett 9:979-84 (1999)  
Target
Name:
Prostaglandin G/H synthase 1/2
Synonyms:
Cyclooxygenase
Type:
Mol. Mass.:
Description:
ASSAY_ID of ChEMBL is 1666355
Components:
This complex has 2 components.
Component 1
Name:
Prostaglandin G/H synthase 2
Synonyms:
Cox-2 Cyclooxygenase Ptgs2
Type:
Enzyme Catalytic Domain
Mol. Mass.:
69173.51
Organism:
RAT
Description:
COX-2 0 RAT::P35355
Residue:
604
  
Component 2
Name:
Prostaglandin G/H synthase 1
Synonyms:
Cox-1 Cyclooxygenase PGH1_RAT Ptgs1
Type:
Enzyme Catalytic Domain
Mol. Mass.:
69033.56
Organism:
RAT
Description:
COX-1 0 RAT::Q63921
Residue:
602
  
Inhibitor
Name:
BDBM50076648
Synonyms:
CHEMBL353553 | Morpholine-4-carboxylic acid {3-[5-(4-chloro-phenyl)-1-(4-methoxy-phenyl)-1H-pyrazol-3-yl]-1-methyl-prop-2-ynyl}-hydroxy-amide
Type:
Small organic molecule
Emp. Form.:
C25H25ClN4O4
Mol. Mass.:
480.943
SMILES:
COc1ccc(cc1)-n1nc(cc1-c1ccc(Cl)cc1)C#CC(C)N(O)C(=O)N1CCOCC1
: