Target
Polyunsaturated fatty acid 5-lipoxygenase
Ligand
BDBM50076664
Substrate
Meas. Tech.
ChEMBL_3970 (CHEMBL618068)
IC50
80±n/a nM
Citation
 Connolly, PJWetter, SKBeers, KNHamel, SCChen, RHWachter, MPAnsell, JSinger, MMSteber, MRitchie, DMArgentieri, DC N-hydroxyurea and hydroxamic acid inhibitors of cyclooxygenase and 5-lipoxygenase. Bioorg Med Chem Lett 9:979-84 (1999)  
Target
Name:
Polyunsaturated fatty acid 5-lipoxygenase
Synonyms:
Alox5 LOX5_RAT
Type:
PROTEIN
Mol. Mass.:
78082.31
Organism:
Rattus norvegicus
Description:
ChEMBL_1432947
Residue:
673
  
Inhibitor
Name:
BDBM50076664
Synonyms:
CHEMBL368145 | N-hydroxy-N-{3-[1-(4-methoxyphenyl)-5-(4-chlorophenyl)-1H-pyrazol-3-yl]prop-2-ynyl}urea
Type:
Small organic molecule
Emp. Form.:
C20H17ClN4O3
Mol. Mass.:
396.827
SMILES:
COc1ccc(cc1)-n1nc(cc1-c1ccc(Cl)cc1)C#CCN(O)C(N)=O
: