Target
Polyunsaturated fatty acid 5-lipoxygenase
Ligand
BDBM50076653
Substrate
Meas. Tech.
ChEMBL_4160 (CHEMBL619227)
IC50
240±n/a nM
Citation
 Connolly, PJWetter, SKBeers, KNHamel, SCChen, RHWachter, MPAnsell, JSinger, MMSteber, MRitchie, DMArgentieri, DC N-hydroxyurea and hydroxamic acid inhibitors of cyclooxygenase and 5-lipoxygenase. Bioorg Med Chem Lett 9:979-84 (1999)  
Target
Name:
Polyunsaturated fatty acid 5-lipoxygenase
Synonyms:
Alox5 LOX5_RAT
Type:
PROTEIN
Mol. Mass.:
78082.31
Organism:
Rattus norvegicus
Description:
ChEMBL_1432947
Residue:
673
  
Inhibitor
Name:
BDBM50076653
Synonyms:
CHEMBL366595 | N-{1-isopropyl-3-[1-(4-methoxyphenyl)-5-(4-methylphenyl)-1H-pyrazol-3-yl]prop-2-ynyl}-N-hydroxyurea
Type:
Small organic molecule
Emp. Form.:
C24H26N4O3
Mol. Mass.:
418.4882
SMILES:
COc1ccc(cc1)-n1nc(cc1-c1ccc(C)cc1)C#CC(C(C)C)N(O)C(N)=O
: