Target
Polyunsaturated fatty acid 5-lipoxygenase
Ligand
BDBM50076659
Substrate
Meas. Tech.
ChEMBL_3970 (CHEMBL618068)
IC50
110±n/a nM
Citation
 Connolly, PJWetter, SKBeers, KNHamel, SCChen, RHWachter, MPAnsell, JSinger, MMSteber, MRitchie, DMArgentieri, DC N-hydroxyurea and hydroxamic acid inhibitors of cyclooxygenase and 5-lipoxygenase. Bioorg Med Chem Lett 9:979-84 (1999)  
Target
Name:
Polyunsaturated fatty acid 5-lipoxygenase
Synonyms:
Alox5 LOX5_RAT
Type:
PROTEIN
Mol. Mass.:
78082.31
Organism:
Rattus norvegicus
Description:
ChEMBL_1432947
Residue:
673
  
Inhibitor
Name:
BDBM50076659
Synonyms:
CHEMBL435907 | N-{3-[5-(4-Chloro-phenyl)-1-(4-methoxy-phenyl)-1H-pyrazol-3-yl]-1-methyl-prop-2-ynyl}-N-hydroxy-acetamide
Type:
Small organic molecule
Emp. Form.:
C22H20ClN3O3
Mol. Mass.:
409.866
SMILES:
COc1ccc(cc1)-n1nc(cc1-c1ccc(Cl)cc1)C#CC(C)N(O)C(C)=O
: