Target
Cyclin-dependent kinase 4/G1/S-specific cyclin-D3
Ligand
BDBM50521925
Substrate
Meas. Tech.
ChEMBL_1885551 (CHEMBL4387133)
Ki
<0.300000±n/a nM
Citation
Target
Name:
Cyclin-dependent kinase 4/G1/S-specific cyclin-D3
Synonyms:
CDK4/Cyclin D3
Type:
Mol. Mass.:
Description:
ASSAY_ID of ChEMBL is 1806445
Components:
This complex has 2 components.
Component 1
Name:
Cyclin-dependent kinase 4
Synonyms:
CDK4 Cell division protein kinase 4 PSK-J3
Type:
Enzyme Subunit
Mol. Mass.:
33731.96
Organism:
Homo sapiens (Human)
Description:
P11802
Residue:
303
  
Component 2
Name:
G1/S-specific cyclin-D3
Synonyms:
CCND3 | CCND3_HUMAN
Type:
Enzyme
Mol. Mass.:
32521.90
Organism:
Homo sapiens (Human)
Description:
P30281
Residue:
292
  
Inhibitor
Name:
BDBM50521925
Synonyms:
CHEMBL4529532
Type:
Small organic molecule
Emp. Form.:
C26H32F2N8
Mol. Mass.:
494.5827
SMILES:
C[C@@H]1CCCCn2ncc(c12)-c1nc(Nc2ccc(cn2)N2CC3(CN(CCCF)C3)C2)ncc1F
: