Target
Tyrosine-protein phosphatase non-receptor type 1
Ligand
BDBM50450001
Substrate
Meas. Tech.
ChEMBL_1886958 (CHEMBL4388635)
IC50
11000±n/a nM
Citation
 Washburn, AAbdeen, SOvechkina, YRay, AMStevens, MChitre, SSivinski, JPark, YJohnson, JHoang, QQChapman, EParish, TJohnson, SM Dual-targeting GroEL/ES chaperonin and protein tyrosine phosphatase B (PtpB) inhibitors: A polypharmacology strategy for treating Mycobacterium tuberculosis infections. Bioorg Med Chem Lett 29:1665-1672 (2019)  
Target
Name:
Tyrosine-protein phosphatase non-receptor type 1
Synonyms:
PTN1_HUMAN PTPN1 Protein tyrosine phosphatase-1B (PTP1B) Protein-tyrosine phosphatase 1B (PTP1B) Tyrosine-protein phosphatase non-receptor type 1 (PTP1B)
Type:
Protein phosphatase
Mol. Mass.:
49963.76
Organism:
Homo sapiens (Human)
Description:
Human recombinant GST-fusion PTP1B (1-435).
Residue:
435
  
Inhibitor
Name:
BDBM50450001
Synonyms:
CHEMBL4162794
Type:
Small organic molecule
Emp. Form.:
C21H13Cl2N3O5S4
Mol. Mass.:
586.511
SMILES:
Clc1ccc(s1)S(=O)(=O)Nc1ccc(cc1)-c1nc2cc(NS(=O)(=O)c3ccc(Cl)s3)ccc2o1
: