Target
TYR_PHOSPHATASE_2 domain-containing protein
Ligand
BDBM50495815
Substrate
Meas. Tech.
ChEMBL_1886957 (CHEMBL4388634)
IC50
23000±n/a nM
Citation
 Washburn, AAbdeen, SOvechkina, YRay, AMStevens, MChitre, SSivinski, JPark, YJohnson, JHoang, QQChapman, EParish, TJohnson, SM Dual-targeting GroEL/ES chaperonin and protein tyrosine phosphatase B (PtpB) inhibitors: A polypharmacology strategy for treating Mycobacterium tuberculosis infections. Bioorg Med Chem Lett 29:1665-1672 (2019)  
Target
Name:
TYR_PHOSPHATASE_2 domain-containing protein
Synonyms:
(PROTEIN-TYROSINE-PHOSPHATASE) (PTPase) PHOSPHOTYROSINE PROTEIN PHOSPHATASE PTPB Phosphotyrosine-protein phosphatase PTPB | Protein Tyrosine Phosphatase PTPB
Type:
Hydrolase
Mol. Mass.:
30152.45
Organism:
Mycobacterium tuberculosis
Description:
Residue:
276
  
Inhibitor
Name:
BDBM50495815
Synonyms:
CHEMBL3115908
Type:
Small organic molecule
Emp. Form.:
C27H24N4O4S2
Mol. Mass.:
532.634
SMILES:
Cc1ccc(cc1)S(=O)(=O)Nc1ccc(cc1)-c1nc2ccc(NS(=O)(=O)c3ccc(C)cc3)cc2[nH]1
: