Target
Glucose-dependent insulinotropic receptor
Ligand
BDBM50523022
Substrate
Meas. Tech.
ChEMBL_1888841 (CHEMBL4390518)
EC50
720±n/a nM
Citation
 Harada, KMizukami, JWatanabe, TMori, GUbukata, MSuwa, KFukuda, SNegoro, TSato, MInaba, T Optimization of oxadiazole derivatives with a spirocyclic cyclohexane structure as novel GPR119 agonists. Bioorg Med Chem Lett 29:2100-2106 (2019)  
Target
Name:
Glucose-dependent insulinotropic receptor
Synonyms:
G-protein coupled receptor 119 (GPR119) GPR119 | Glucose-dependent insulinotropic receptor
Type:
Protein
Mol. Mass.:
36901.49
Organism:
Homo sapiens (Human)
Description:
Q8TDV5
Residue:
335
  
Inhibitor
Name:
BDBM50523022
Synonyms:
CHEMBL4549349
Type:
Small organic molecule
Emp. Form.:
C21H27FN2O5S
Mol. Mass.:
438.513
SMILES:
CC(O[C@H]1CC[C@]2(CCCO2)CC1)c1nc(no1)-c1ccc(CS(C)(=O)=O)c(F)c1
: