Target
Glucose-dependent insulinotropic receptor
Ligand
BDBM50523026
Substrate
Meas. Tech.
ChEMBL_1888841 (CHEMBL4390518)
EC50
2457±n/a nM
Citation
 Harada, KMizukami, JWatanabe, TMori, GUbukata, MSuwa, KFukuda, SNegoro, TSato, MInaba, T Optimization of oxadiazole derivatives with a spirocyclic cyclohexane structure as novel GPR119 agonists. Bioorg Med Chem Lett 29:2100-2106 (2019)  
Target
Name:
Glucose-dependent insulinotropic receptor
Synonyms:
G-protein coupled receptor 119 (GPR119) GPR119 | Glucose-dependent insulinotropic receptor
Type:
Protein
Mol. Mass.:
36901.49
Organism:
Homo sapiens (Human)
Description:
Q8TDV5
Residue:
335
  
Inhibitor
Name:
BDBM50523026
Synonyms:
CHEMBL4442686
Type:
Small organic molecule
Emp. Form.:
C24H32FN3O4
Mol. Mass.:
445.527
SMILES:
CC(O[C@H]1CC[C@@]2(COC(C)(C)C2)CC1)c1nc(no1)-c1ccc(C(=O)N(C)C)c(F)c1
: