Target
Cholinesterase
Ligand
BDBM50523088
Substrate
Meas. Tech.
ChEMBL_1888971 (CHEMBL4390725)
IC50
214000±n/a nM
Citation
 Asghar, AYousuf, MMubeen, HNazir, RHaruna, KOnawole, ATRasheed, L Synthesis, spectroscopic characterization, molecular docking and theoretical studies (DFT) of N-(4-aminophenylsulfonyl)-2-(4-isobutylphenyl) propanamide having potential enzyme inhibition applications. Bioorg Med Chem 27:2397-2404 (2019)  
Target
Name:
Cholinesterase
Synonyms:
Acylcholine acylhydrolase Butyrylcholine esterase (BChE) Butyrylcholinesterase (BuChE) CHLE_HUMAN Cholinesterases Pseudocholinesterase
Type:
Homotetramer
Mol. Mass.:
68422.27
Organism:
Homo sapiens (Human)
Description:
P06276
Residue:
602
  
Inhibitor
Name:
BDBM50523088
Synonyms:
CHEMBL4439928
Type:
Small organic molecule
Emp. Form.:
C19H24N2O3S
Mol. Mass.:
360.47
SMILES:
CC(C)Cc1ccc(cc1)C(C)C(=O)NS(=O)(=O)c1ccc(N)cc1
: