Target
Acetylcholinesterase
Ligand
BDBM10857
Substrate
Meas. Tech.
ChEMBL_1888969 (CHEMBL4390723)
IC50
145000±n/a nM
Citation
 Asghar, AYousuf, MMubeen, HNazir, RHaruna, KOnawole, ATRasheed, L Synthesis, spectroscopic characterization, molecular docking and theoretical studies (DFT) of N-(4-aminophenylsulfonyl)-2-(4-isobutylphenyl) propanamide having potential enzyme inhibition applications. Bioorg Med Chem 27:2397-2404 (2019)  
Target
Name:
Acetylcholinesterase
Synonyms:
ACES_HUMAN Acetylcholinesterase (AChE) | Acetylcholinesterase (human AChE)
Type:
Enzyme
Mol. Mass.:
67792.70
Organism:
Homo sapiens (Human)
Description:
P22303
Residue:
614
  
Inhibitor
Name:
BDBM10857
Synonyms:
4-aminobenzene-1-sulfonamide Sulfanilamide aromatic/heteroaromatic sulfonamide 2 | halogenosulfanilamide deriv. 5a
Type:
Small organic molecule
Emp. Form.:
C6H8N2O2S
Mol. Mass.:
172.205
SMILES:
Nc1ccc(cc1)S(N)(=O)=O
: