Target
5'-nucleotidase
Ligand
BDBM50523511
Substrate
Meas. Tech.
ChEMBL_1890513 (CHEMBL4392267)
Ki
11±n/a nM
Citation
 Junker, ARenn, CDobelmann, CNamasivayam, VJain, SLosenkova, KIrjala, HDuca, SBalasubramanian, RChakraborty, SBörgel, FZimmermann, HYegutkin, GGMüller, CEJacobson, KA Structure-Activity Relationship of Purine and Pyrimidine Nucleotides as Ecto-5'-Nucleotidase (CD73) Inhibitors. J Med Chem 62:3677-3695 (2019)  
Target
Name:
5'-nucleotidase
Synonyms:
5'-NT 5NTD_HUMAN Ecto-5'-nucleotidase NT5 NTE
Type:
Enzyme
Mol. Mass.:
63371.54
Organism:
Homo sapiens (Human)
Description:
P21589
Residue:
574
  
Inhibitor
Name:
BDBM50523511
Synonyms:
CHEMBL4443977
Type:
Small organic molecule
Emp. Form.:
C18H25N3O11P2
Mol. Mass.:
521.3521
SMILES:
Cn1c(=O)n(cc\c1=N/OCc1ccccc1)[C@@H]1O[C@H](COP(O)(=O)CP(O)(O)=O)[C@@H](O)[C@H]1O
: