Target
UDP-glucuronosyltransferase 1A1
Ligand
BDBM13934
Substrate
Meas. Tech.
ChEMBL_1890699 (CHEMBL4392453)
IC50
4200±n/a nM
Citation
 A M Subbaiah, MMandlekar, SDesikan, SRamar, TSubramani, LAnnadurai, MDesai, SDSinha, SJenkins, SMKrystal, MRSubramanian, MSridhar, SPadmanabhan, SBhutani, PArla, RSingh, SSinha, JThakur, MKadow, JFMeanwell, NA Design, Synthesis, and Pharmacokinetic Evaluation of Phosphate and Amino Acid Ester Prodrugs for Improving the Oral Bioavailability of the HIV-1 Protease Inhibitor Atazanavir. J Med Chem 62:3553-3574 (2019)  
Target
Name:
UDP-glucuronosyltransferase 1A1
Synonyms:
2.4.1.17 UDP-glucuronosyltransferase 1-1 UDPGT 1-1 UGT1-01 Ugt1 | Ugt1a1
Type:
PROTEIN
Mol. Mass.:
59680.28
Organism:
Rattus norvegicus
Description:
ChEMBL_119089
Residue:
535
  
Inhibitor
Name:
BDBM13934
Synonyms:
Atazanavir CGP 73547 Latazanavir methyl N-[(1S)-1-[[(2S,3S)-3-hydroxy-4-[[[(2S)-2-(methoxycarbonylamino)-3,3-dimethyl-butanoyl]amino]-[(4-pyridin-2-ylphenyl)methyl]amino]-1-phenyl-butan-2-yl]carbamoyl]-2,2-dimethyl-propyl]carbamate | methyl N-[(1S)-1-{[(2S,3S)-3-hydroxy-4-[(2S)-2-[(methoxycarbonyl)amino]-3,3-dimethyl-N'-{[4-(pyridin-2-yl)phenyl]methyl}butanehydrazido]-1-phenylbutan-2-yl]carbamoyl}-2,2-dimethylpropyl]carbamate
Type:
Small organic molecule
Emp. Form.:
C38H52N6O7
Mol. Mass.:
704.8555
SMILES:
COC(=O)N[C@H](C(=O)N[C@@H](Cc1ccccc1)[C@@H](O)CN(Cc1ccc(cc1)-c1ccccn1)NC(=O)[C@@H](NC(=O)OC)C(C)(C)C)C(C)(C)C
: