Target
Protease
Ligand
BDBM50523561
Substrate
Meas. Tech.
ChEMBL_1890717 (CHEMBL4392471)
IC50
4.0±n/a nM
Citation
 A M Subbaiah, MMandlekar, SDesikan, SRamar, TSubramani, LAnnadurai, MDesai, SDSinha, SJenkins, SMKrystal, MRSubramanian, MSridhar, SPadmanabhan, SBhutani, PArla, RSingh, SSinha, JThakur, MKadow, JFMeanwell, NA Design, Synthesis, and Pharmacokinetic Evaluation of Phosphate and Amino Acid Ester Prodrugs for Improving the Oral Bioavailability of the HIV-1 Protease Inhibitor Atazanavir. J Med Chem 62:3553-3574 (2019)  
Target
Name:
Protease
Synonyms:
Type:
Enzyme
Mol. Mass.:
10904.79
Organism:
Human immunodeficiency virus 1 (HIV-1)
Description:
Q9YQ12
Residue:
99
  
Inhibitor
Name:
BDBM50523561
Synonyms:
CHEMBL4437104
Type:
Small organic molecule
Emp. Form.:
C48H70N8O9
Mol. Mass.:
903.1176
SMILES:
COC(=O)N[C@H](C(=O)N[C@@H](Cc1ccccc1)[C@H](CN(Cc1ccc(cc1)-c1ccccn1)NC(=O)[C@@H](NC(=O)OC)C(C)(C)C)OC(=O)[C@@H](NC(=O)[C@@H](N)C(C)C)C(C)C)C(C)(C)C
: