Target
Potassium voltage-gated channel subfamily H member 2
Ligand
BDBM50523624
Substrate
Meas. Tech.
ChEMBL_1890740 (CHEMBL4392494)
Ki
1641±n/a nM
Citation
 Yu, YWu, ZShi, ZCHe, SLai, ZCernak, TAVachal, PLiu, MLiu, JHong, QJian, TGuiadeen, DKrikorian, ASperbeck, DMVerras, ASonatore, LMMurphy, BAWiltsie, JChung, CCGorski, JNLiu, JXiao, JWolff, MTong, SXMadeira, MKaranam, BVShen, DMBalkovec, JMDe Vita, RJPinto, SNargund, RP Accelerating the discovery of DGAT1 inhibitors through the application of parallel medicinal chemistry (PMC). Bioorg Med Chem Lett 29:1380-1385 (2019)  
Target
Name:
Potassium voltage-gated channel subfamily H member 2
Synonyms:
1,3-beta-glucan synthase component GLS2 ERG Eag-related protein 1 Ether-a-go-go-related gene (HERG) Ether-a-go-go-related gene potassium channel 1 Ether-a-go-go-related gene potassium channel 1 (hERG1) Ether-a-go-go-related protein 1 H-ERG KCNH2 Potassium voltage-gated channel subfamily H member 2 (hERG) Voltage-gated potassium channel subunit Kv11.1 hERG Potassium Channel 1 | putative potassium channel subunit
Type:
Multi-pass membrane protein
Mol. Mass.:
126672.65
Organism:
Homo sapiens (Human)
Description:
Q12809
Residue:
1159
  
Inhibitor
Name:
BDBM50523624
Synonyms:
CHEMBL4575608
Type:
Small organic molecule
Emp. Form.:
C20H13F3N2O
Mol. Mass.:
354.3252
SMILES:
Oc1ccc(cc1)-c1ccc(cc1)-c1nc2cc(ccc2[nH]1)C(F)(F)F
: