Target
Chaperonin GroEL
Ligand
BDBM60918
Substrate
Meas. Tech.
ChEMBL_1891104 (CHEMBL4392931)
IC50
>250000±n/a nM
Citation
 Stevens, MAbdeen, SSalim, NRay, AMWashburn, AChitre, SSivinski, JPark, YHoang, QQChapman, EJohnson, SM HSP60/10 chaperonin systems are inhibited by a variety of approved drugs, natural products, and known bioactive molecules. Bioorg Med Chem Lett 29:1106-1112 (2019)  
Target
Name:
Chaperonin GroEL
Synonyms:
60 kDa chaperonin A8G17_01625 A9R57_13545 AC067_05505 ACN002_4372 ACN81_06325 ACU90_27610 AKG99_18195 AM270_14500 AM464_15770 AMK83_27450 APT13_02995 APZ14_01135 AU473_28145 AUS26_18735 AW106_26290 AWF59_005875 AXA56_02180 AZE03_09980 B7C53_14115 B9N28_21670 B9T59_10250 BANRA_00147 BANRA_02830 BE963_12230 BER14_11410 BH694_19650 BHS81_24830 BIQ87_23895 BIZ41_02710 BK248_23630 BK334_08295 BK375_06855 BK400_02730 BMT53_11945 BN17_41231 BON66_25750 BON76_04275 BON92_18275 BON96_03715 BTQ04_18135 BUE81_24315 BW690_22405 BXT93_23590 BZL69_06910 BvCms2454_04385 BvCmsA75A_02316 BvCmsF63A_01379 BvCmsHHP001_00679 BvCmsHHP056_01305 BvCmsKKP036_00132 BvCmsKSNP019_03303 BvCmsKSNP081_01939 BvCmsKSP008_05437 BvCmsKSP015_03624 BvCmsKSP024_01292 BvCmsKSP036_01506 BvCmsKSP045_02508 BvCmsKSP058_02605 BvCmsKSP067_03875 BvCmsKSP083_02935 BvCmsNSNP023_02526 BvCmsNSNP036_02363 BvCmsNSP007_04896 BvCmsNSP045_04079 BvCmsNSP052_03163 BvCmsNSP078_00002 BvCmsSINP011_01477 BvCmsSINP036_01420 BvCmsSIP010_01340 BvCmsSIP044_04391 C1I57_02515 C2858_12005 C2U48_11800 C3B70_03755 C4K41_15740 C5715_24370 C5P01_11485 C5P44_18550 C6669_06700 C6A57_08340 C7235_22800 C7B06_19620 C7B08_13320 C9025_24790 C9200_11080 C9255_05360 C9E25_08280 C9Y80_28140 CA593_05105 CCZ11_19940 CCZ16_17425 CCZ18_09570 CG691_04055 CG705_07485 CI641_014245 CIJ94_19305 COD30_28660 CPA47_23805 CR539_02660 CRE06_15175 CRT43_24985 CRT55_26565 CT143_14485 CU078_13310 CV83915_01888 CWM24_06435 CXB56_25445 D0X26_12780 D2183_06170 D2185_07635 D3822_10750 D3I61_24435 D3Y67_00555 D4M06_29410 D7K66_01645 D9D20_08430 D9D33_02520 D9E34_15015 D9E49_11975 D9G42_15395 D9H53_05445 D9H70_08850 D9I11_08160 D9I87_11050 D9I97_14780 D9J44_18175 D9J60_12275 D9K54_26350 D9L89_29680 D9N32_18890 D9X97_28710 DAH27_28010 DAH37_06370 DD762_21030 DEN86_00710 DEO11_24170 DIV10_26330 DK268_16985 DK278_16485 DK288_16415 DKP82_04065 DKP87_04530 DL195_09030 DL545_22730 DM102_08870 DMI04_11460 DNB37_06985 DNK79_13900 DNQ45_22695 DNX30_08345 DOY56_08400 DP258_24460 DQE83_13435 DQO13_25440 DS966_08020 DS986_22665 DTL43_02185 DTL90_17410 DTM25_10765 DTM45_21115 DU333_08465 DWB25_22555 E0E06_20445 E2126_03520 E2855_05287 E5M00_23405 EAI46_05875 EB509_04245 EB515_02245 EC1094V2_4111 EC3426_00475 EC95NR1_03760 ECTO124_04553 ECs5124 ED225_27880 ED607_16100 ED903_07130 ED944_28230 EEA45_28005 EF173_02240 EGT48_17625 EIA08_20145 EJC75_20460 EKI52_12830 EL79_4200 ELT33_14955 ELV00_11890 ELV13_23125 ELV32_12780 EO241_15015 EPS91_16025 EPS97_10040 EQ830_14810 ERS085366_02367 ERS085379_04164 ERS085386_01025 ERS085416_03698 ERS150873_01289 EVY14_04860 EWK56_08835 EXM29_20525 EXX13_20070 EXX24_09465 EXX55_21120 EXX78_13730 EYD11_20730 Eco118UI_24470 ExPECSC036_01160 ExPECSC065_03193 FORC82_4346 GroEL protein HmCms184_03267 HmCmsJML079_00812 HmCmsJML204_04031 MJ49_08265 MS8345_04771 NCTC10090_02607 NCTC10764_04513 NCTC10865_05650 NCTC11112_02719 NCTC11341_03019 NCTC12950_04949 NCTC13127_05944 NCTC13462_02684 NCTC13919_01679 NCTC7927_05027 NCTC8500_05095 NCTC8622_02021 NCTC8960_02051 NCTC9007_00921 NCTC9036_04433 NCTC9044_02622 NCTC9050_02551 NCTC9058_02377 NCTC9062_03620 NCTC9077_05690 NCTC9110_04320 NCTC9117_05641 NCTC9434_02173 NCTC9702_05313 NCTC9706_01822 NCTC9777_00950 NCTC9965_04672 PGD_03325 Protein Cpn60 RK56_012245 SAMEA3472033_01789 SAMEA3472044_01554 SAMEA3472055_04142 SAMEA3472067_02182 SAMEA3472080_00128 SAMEA3472090_01020 SAMEA3472112_01087 SAMEA3472115_00492 SAMEA3472127_01593 SAMEA3484429_03091 SAMEA3484434_04204 SAMEA3485103_02882 SAMEA3751239_02348 SAMEA3752372_01184 SAMEA3752553_04400 SAMEA3752620_03454 SAMEA3753064_01580 SAMEA3753093_02616 SAMEA3753106_03412 SAMEA3753164_04038 SAMEA3753300_00682 SAMEA3753391_00661 SK85_04506 U14A_04542 UN91_24955 WR15_07175 groL mopA
Type:
PROTEIN
Mol. Mass.:
57309.59
Organism:
Escherichia coli
Description:
ChEMBL_117709
Residue:
548
  
Inhibitor
Name:
BDBM60918
Synonyms:
5-Amino-2-hydroxy-benzoic acid MLS001424012 cid_4075
Type:
Small organic molecule
Emp. Form.:
C7H7NO3
Mol. Mass.:
153.1354
SMILES:
Nc1ccc(O)c(c1)C(O)=O
: