Target
Thiosulfate sulfurtransferase
Ligand
BDBM50451094
Substrate
Meas. Tech.
ChEMBL_1891102 (CHEMBL4392929)
IC50
53000±n/a nM
Citation
 Stevens, MAbdeen, SSalim, NRay, AMWashburn, AChitre, SSivinski, JPark, YHoang, QQChapman, EJohnson, SM HSP60/10 chaperonin systems are inhibited by a variety of approved drugs, natural products, and known bioactive molecules. Bioorg Med Chem Lett 29:1106-1112 (2019)  
Target
Name:
Thiosulfate sulfurtransferase
Synonyms:
2.8.1.1 THTR_HUMAN Thiosulfate sulfurtransferase
Type:
PROTEIN
Mol. Mass.:
33432.06
Organism:
Homo sapiens
Description:
ChEMBL_118080
Residue:
297
  
Inhibitor
Name:
BDBM50451094
Synonyms:
Ascorbyl Palmitate E304
Type:
Small organic molecule
Emp. Form.:
C22H38O7
Mol. Mass.:
414.5329
SMILES:
[H][C@@]1(OC(=O)C(O)=C1O)[C@@H](O)COC(=O)CCCCCCCCCCCCCCC
: