Target
Sigma non-opioid intracellular receptor 1
Ligand
BDBM50524440
Substrate
Meas. Tech.
ChEMBL_1893315 (CHEMBL4395236)
Ki
0.780000±n/a nM
Citation
 Romeo, GPrezzavento, OIntagliata, SPittalà, VModica, MNMarrazzo, ATurnaturi, RParenti, CChiechio, SArena, ECampisi, ASposito, GSalerno, L Synthesis, in vitro and in vivo characterization of new benzoxazole and benzothiazole-based sigma receptor ligands. Eur J Med Chem 174:226-235 (2019)  
Target
Name:
Sigma non-opioid intracellular receptor 1
Synonyms:
OPRS1 SIGMAR1 Sigma non-opioid intracellular receptor 1 Sigma1-receptor Sterol isomerase-like protein
Type:
Protein
Mol. Mass.:
25307.17
Organism:
Cavia porcellus (Guinea pig)
Description:
Q60492
Residue:
223
  
Inhibitor
Name:
BDBM50524440
Synonyms:
CHEMBL4441396
Type:
Small organic molecule
Emp. Form.:
C17H23ClN2OS
Mol. Mass.:
338.895
SMILES:
Clc1ccc2sc(=O)n(CCCCN3CCCCCC3)c2c1
: